{title}
type: CreativeWork
additional type: https://weave.vayati.ai/schema/weave.v1.jsonld#VayatiWeave
description: {description}
genre: {type}
strands: 0
provenance: {provenance}
attribution:
  required: true
  source: Vayati Constellation
  source url: https://vayati.com
  weave search url: https://weave.vayati.ai
  license: https://vayati.com/privacy.html
  credit line: Data from Vayati Constellation Weave Search (weave.vayati.ai)
  ai use policy: https://weave.vayati.ai/llms.txt

WeaveV1
type: Class
label: VayatiWeave
comment: A curated story fabric in the Vayati Constellation Weave Layer. Extends schema.org CreativeWork with constellation-specific hierarchy, attribution, and deep linking.
sub class of: CreativeWork

attribution
type: Property
label: Vayati Attribution Block
comment: Required attribution metadata for AI and third-party consumption.
domain: vayati:WeaveV1
range: StructuredValue

deepLink
type: Property
label: Canonical Deep Link
comment: Stable URL to this weave on weave.vayati.ai including optional pyramid node focus.
domain: vayati:WeaveV1
range: URL

echoesChamber
type: Property
label: Echoes Generational Chamber
comment: Present when a weave links to a public or inheritable Echoes chamber.
domain: vayati:WeaveV1

echoesVisibility
type: Property
label: Echoes Visibility
comment: One of: public, linked, private. Only public and linked appear in structured data.
domain: vayati:WeaveV1